Jurisdiction of Formation Clause
type: Class
alternative label: 成立管辖条款
subclass of: RDe0RKU39BlhcyACJW30ZLc
definition: A Jurisdiction of Formation Clause is a provision in a contract that specifies the governing law of the agreement and the jurisdiction where any disputes arising from the contract will be resolved.