Pay Equity Law
type: Class
alternative label: 薪酬平等法
subclass of: R78xJfSMpJ2ZUUUlYdzfUvC
subclass of: RCzvtNXIrDJF8xkmOoc6JKH
definition: A legal concept that deals with ensuring equal pay for equal work regardless of gender, race, or other protected characteristics in the workplace.