Ticket
type: Class
alternative label: 票
subclass of: R7zvYKadqTXgMZV8ghLsloR
subclass of: RqMjkNJ0fgxLg2NEgI3BrJ
definition: A ticket is a legal document used in trial court practice to initiate or respond to a legal action.