Missouri Circuit Court - Cedar County
type: Class
subclass of: RDECjssxw76vdlahxiUTb4L
definition: Missouri Circuit Court - Cedar County: A specific court within the Missouri Circuit Court system that has jurisdiction over legal matters within Cedar County, Missouri.