Photograph
type: Class
alternative label: Photo
alternative label: Picture
alternative label: Snapshot
subclass of: R9fKvjVlII2PEtadGEDimB9
definition: A Photograph is an image captured by a camera that records a visual representation of a subject using light-sensitive materials or digital sensors. Protected under copyright law, photographs grant the photographer exclusive rights to reproduce, distribute, and display the image.