Labor and Employment Law Regulatory Objectives
type: Class
subclass of: RCDwLiS22z6MzQaQHS08hvk
definition: Labor and Employment Law Regulatory Objectives encompass the fundamental principles and considerations surrounding labor and employment law.