Zulu
type: Class
alternative label: 祖鲁语
subclass of: RDOvAHsvY8TKJ1O1orXPM9o
definition: A language spoken primarily in South Africa, characterized by its use of click consonants and belonging to the Bantu language family.