Registration Rights Clause
type: Class
alternative label: 注册权条款
subclass of: RDe0RKU39BlhcyACJW30ZLc
definition: A Registration Rights Clause is a provision in a contract that grants the right to a party to register securities with the Securities and Exchange Commission (SEC) for public sale.