Easement by Prescription
type: Class
alternative label: 习得权负担
subclass of: R93T7OEmCjkwufvhJAY4ScV
definition: A legal right to use someone else's property for a specific purpose, which is gained through continuous and uninterrupted use of the property for a certain period of time without the owner's permission.