Energy Sales and Transmission Law
type: Class
alternative label: 销售和转让法
subclass of: R9pmjLDKAMzm147xIPPq5ul
hidden label: SLTR
definition: Law involving all aspects of the economic regulation of energy utilities including electric utilities, power generation and electric transmission, distribution of electricity, natural gas, crude and petroleum, and coal.