Missouri Circuit Court - Andrew County
type: Class
subclass of: RDECjssxw76vdlahxiUTb4L
definition: A Missouri Circuit Court in Andrew County is a specific court within the Missouri Circuit Court system that has jurisdiction over civil and criminal cases within Andrew County, Missouri.