Otolaryngology Negligence
type: Class
alternative label: 耳鼻喉科疏忽
subclass of: R7Zbqfhemxs6PR7r2Fk6NeY
definition: Negligence in the field of otolaryngology, which involves the diagnosis and treatment of ear, nose, and throat conditions.