Ionia Nisia
type: Class
alternative label: GR+F
subclass of: R5CB856E87466FF97b1146c3
hidden label: GR+F
definition: Ionia Nisia refers to a group of islands located in the Aegean Sea, specifically in the eastern part of the Greek archipelago.