LEDES XML E-Billing Ver. 2.2
type: Class
subclass of: RB4cFSLB4xvycDlKv73dOg6
definition: LEDES XML E-Billing Ver. 2.2 is a standardized format for electronic billing used in legal practice, which includes various segments such as tax, expense, fee, and matter information, and is a child of the Standards Compatibility class.