Other Schools and Instruction Industry
type: Class
preferred label: Other Schools and Instruction
alternative label: 其他学校和教学行业
subclass of: RB7IaNyshrHiqug0LlmK6J2
hidden label: SCHX
definition: Includes Fine Arts Schools, Sports and Recreation Instruction, Language Schools, All Other Schools and Instruction.