Firm Assistant / Secretary
type: Class
preferred label: Secretary
alternative label: 公司助理/秘书
subclass of: RCeEdzen5sS4qh0lfvncqh7
subclass of: RQxwZ0byxdnIYBnX6xystH
definition: A Firm Assistant/Secretary is a non-timekeeping provider who supports the delivery of legal services by performing administrative tasks within a law firm.