base_amount
type: Class
subclass of: R8ktJqdQifgzEaV2DJkdMZa
subclass of: R9VdnoybnEodiN0EUTedSOz
definition: "The original WIP value of the time entry before adjustments or discounts of any sort are applied. Regardless of charge_type, then base_amount = units * rate prior to any adjustments or discounts. E.g. ""300.0000"" "