California Superior Court - Riverside Cty.
type: Class
subclass of: RsTnyZoBckeYgjbwks7DL8
definition: A court of general jurisdiction in Riverside County, California, with authority to hear and decide a wide range of legal cases within its geographical jurisdiction.