Living Apart Pursuant to Separation Decree
type: Class
alternative label: 根据分居令分居
subclass of: RBvfJW4HbL3Y7Guu9ENS7w2
definition: Living Apart Pursuant to Separation Decree: The legal status of a couple who have obtained a separation decree and are living separately, as ordered by the court.