Defective Trade Practices Act Claim
type: Class
alternative label: 《缺陷商品交易行为法》索赔
subclass of: R7MsH9WtTPf14W1GB1m8zrB
subclass of: R9LVBKjvGRuzwgtlhuLST36
definition: A Defective Trade Practices Act Claim is a legal claim that arises from a product liability issue and is based on a violation of statutory and regulatory laws related to trade practices.