Zenaga
type: Class
subclass of: RDOvAHsvY8TKJ1O1orXPM9o
definition: Zenaga is a structured system of communication that belongs to the language family, and is spoken by the Zenaga people in Mauritania and Western Sahara.