Waiver of Bond Provision
type: Class
alternative label: 免除保证金条款
subclass of: R8Bdj1eCxXbeaYx70Wt6JN5
definition: A Waiver of Bond Provision is a clause within a Specific Performance agreement that allows the party seeking performance to waive the requirement of posting a bond to secure the performance.