Indiana Superior Court - Shelby County
type: Class
subclass of: R7uq2Mq8qLUybQoDhVczzZ5
definition: Indiana Superior Court - Shelby County is a specific court within the Indiana Superior Court system that has jurisdiction over legal matters within Shelby County, Indiana.