Constructive Fraud
type: Class
alternative label: 建设性欺诈
subclass of: R8GyyJdxlZtc7PsW9vLAKfE
definition: Constructive Fraud is a type of fraud claim that arises when a party's actions or omissions, although not intentionally fraudulent, result in harm or injury to another party.