Georgia Superior Court - Forsyth County
type: Class
subclass of: RCBE5bLTCIia7wAstjMsnKO
definition: A court of general jurisdiction in the state of Georgia, located in Forsyth County and responsible for hearing civil and criminal cases within its jurisdiction.