Deceptive Trade Practices
type: Class
alternative label: 欺诈性商业行为
subclass of: R7MsH9WtTPf14W1GB1m8zrB
subclass of: R8viNe7dpcLA9kGH5gl7YE6
definition: Deceptive Trade Practices refer to actions taken by a business or individual that misleads consumers or other businesses in order to gain an unfair advantage in the marketplace, and can be a basis for legal claims related to product liability or unfair competition.