Creditor Among 20 Largest Unsecured Creditors
type: Class
alternative label: 20大无担保债权人中的债权人
subclass of: RrYc14SDMHyXfplFhiI2Ok
definition: A creditor among the 20 largest unsecured creditors is a person or entity who is owed a debt by a debtor and is one of the top 20 creditors who do not have a security interest in the debtor's property.