Pre-Flight Inspection
type: Class
alternative label: PFI
subclass of: R8cGjHXv3vecVd4ZO6HVjo
definition: "Pre-Flight Inspection (PFI)" is a security and immigration procedure that occurs before an individual boards an aircraft destined for a specific country, ensuring compliance with entry requirements and verifying eligibility to travel to the destination