Counterclaim
type: Class
alternative label: 反诉
subclass of: R8C54zmV0Z524i5HvGoq7p9
definition: A counterclaim is a legal action brought by a defendant against a plaintiff, in response to the plaintiff's claim, seeking relief or damages.