230 Rent Lease & Ejectment (PACER NoS)
type: Class
subclass of: RbYFWy3aL3B2HCQhVuEWyx
definition: Action for rental or lease payments owed on real property and/or to eject a party occupying real property illegally.