Motion to Remove
type: Class
alternative label: 撤销动议
subclass of: RC339aKhjRAuw4JtEQUn5xw
definition: A Motion to Remove is a legal request made by a defendant in a civil case to transfer the case from state court to federal court.