Fee Credit Category
type: Class
alternative label: 费用信用类别
subclass of: R8DuEmmnbcptnIZhPdF2Tvx
definition: A Fee Credit Category is a type of discount or credit that can be applied to legal services fees.