Alifu Alifu
type: Class
alternative label: MV+02
subclass of: R45D3d83F1c4603C9903Af83
hidden label: MV+02
definition: Alifu Alifu is a subdivision of the Maldives, typically referring to a group of islands or atolls within the country.