Louisiana Supreme Court
type: Class
subclass of: R99F253EB4991DD4767D3f46
definition: The Louisiana Supreme Court is the highest court in the state of Louisiana, with the authority to hear appeals from lower state courts.