Regulatory Objectives
type: Class
alternative label: 监管目标
subclass of: RlNFgB3TQfMzV26V4V7u4E
definition: Objectives related to regulatory filings (e.g., trademark application, patent applications, copyright registrations).