Bureau of Justice Statistics
type: Class
alternative label: 司法统计局
subclass of: RA731f594B650D6876859259
hidden label: BJS
definition: The United States Bureau of Justice Statistics (BJS) is a federal government agency belonging to the U.S. Department of Justice and a principal agency of the U.S. Federal Statistical System.