Terms of Sale
type: Class
subclass of: R7KnhbKXnWBeCBhayT7e9BY
definition: Terms of Sale specify the conditions under which a sale is transacted. These terms outline payment methods, delivery timelines, transfer of ownership, return policies, and other conditions and obligations relevant to the sale of goods or services.