Securities and Financial Instruments Law
type: Class
preferred label: Capital Markets Law
alternative label: 证券和金融工具法
subclass of: RSYBzf149Mi5KE0YtmpUmr
hidden label: SECU
definition: Law covering transactions and other dealings with securities including both federal- and state-level regulation by purely governmental regulatory agencies, listing requirements of exchanges, and rules of self-regulatory organizations.