Georgia District Court - Tift County
type: Class
subclass of: RBxw7BF15bDA0Ifn2vOrC8h
definition: A court located in Tift County, Georgia that has jurisdiction over certain legal matters within its geographical boundaries.