L410 Fact Witnesses
type: Class
subclass of: RDkc9fh6vYvZbJc7ERuIJCf
definition: A fact witness is a person who provides testimony in a trial based on their personal knowledge of the events or facts in question.