Maltese
type: Class
alternative label: 马耳他语
subclass of: RDOvAHsvY8TKJ1O1orXPM9o
definition: Maltese is a structured system of communication consisting of grammar and vocabulary, used in legal matters, that is specific to the Maltese islands and spoken by the Maltese people.