Antitrust Claims
type: Class
alternative label: 反垄断索赔
subclass of: R7u1GstOpfAmZ3mI7yFcbgU
subclass of: R8jYAnNATrfoBxAtIKpf72X
definition: Antitrust Claims refer to legal claims made against individuals or companies for engaging in anti-competitive behavior, such as market allocation, vertical or horizontal agreements, pricing, or conspiracy.