Application to Pay Filing Fees in Installments
type: Class
alternative label: 分期支付申请书
subclass of: RtSJkLiGzcKx8PVlCAB5q5
definition: An Application to Pay Filing Fees in Installments is a request made in a bankruptcy application to pay the required fees in installments rather than in a lump sum.