Technology Procurement Services
type: Class
subclass of: R9EU57yyGYQyG3GeOJ1VgMr
definition: Technology Procurement Services refers to the process of acquiring technology products and services for an organization, typically involving consulting and management services.