Motion to Withdraw as Counsel
type: Class
preferred label: Motion to be Relieved As Counsel
alternative label: 撤回律师申请书
subclass of: R7z9q6EKXwifsayj0YR6x58
subclass of: RqWMTLHpIRhAQzo2b3fYSy
definition: A Motion to Withdraw as Counsel is a formal request made by an attorney to be removed from representing a client in a legal matter.