Subcontractors Clause
type: Class
alternative label: 分包商条款
subclass of: RDe0RKU39BlhcyACJW30ZLc
definition: A Subcontractors Clause is a provision in a contract that allows the primary contractor to hire other individuals or companies to perform some or all of the work required under the contract.