Motion to File Amendment
type: Class
alternative label: 提交修正案动议
subclass of: R8xekNn7K6SxToo5ArjIsTX
definition: A Motion to File Amendment is a formal request to submit a revised version of a document or pleading to a court or other legal authority.