Motion to Disqualify Judge on Due Process Grounds
type: Class
alternative label: 基于正当程序的理由提出撤销法官的动议
subclass of: RDtF3TBuYodaMEI2cA1Hb4H
definition: A Motion to Disqualify Judge on Due Process Grounds is a legal request to remove a judge from a case based on a violation of the defendant's right to a fair trial.