Dismissal
type: Class
alternative label: 解雇
subclass of: RDBXUrFP9mCZLCxzqy8nbEX
definition: Dismissal is a type of trial court created document that terminates a case without a decision on the merits, and can be either voluntary or involuntary, with or without prejudice, and for various reasons such as violation of rules or failure to prosecute.