Matters Listed on Disclosure Schedules Language
type: Class
alternative label: 披露时间表上列出的事项语言
subclass of: R67fwZw741EuZY3jLZhsoZ
definition: A description of specific language used in disclosure schedules that list exceptions to the definition of Material Adverse Effect (MAE) in a legal agreement.